{"text_format":"1","workbook":"xlsx","n_sheets":11,"sheets":["Summary of Funding","Budget Share Statement","Minimum Funding Level","MFG Calculation","De-delegation","EYSFF statement","Further Delegation Info","ISB","LogIn","LoginPage","Funding Floor"],"not_rendered":{"charts":0,"images":0,"macros":1,"external_links":16,"defined_names":22,"comments":0,"pivot_tables":0},"unopened":[],"bounds":{"document_bytes":16777216,"sheet_cells":100000,"rows_first":2000,"rows_last":500,"rows_between":2000,"halvings":0,"cell_chars":16384,"cell_head_chars":4096},"cells_cut":0,"cells_raw":0,"read":"whole","date_system":"1900"}

{"sheet":"Summary of Funding","index":0,"n_rows":42,"n_cols":14,"rows_kept":42,"cut":false,"hidden":true,"merged":[[2,0,2,7],[3,0,3,7],[5,0,5,7],[1,0,1,7],[9,0,9,2],[17,0,17,3]]}
["Date Issued: 4th July 2022",null,null,null,null,null,null,"Last amended: 1st July 2022"]
["COVENTRY CITY COUNCIL"]
["2022/23 Funding Allocations for Schools",null,null,null,null,null,null,null,null,null,null,null,null,25]
["INDICATIVE Summary of Funding"]
[]
[{"$f":"VLOOKUP((\"P\"&N3),[5]Formula!$A$10:$X$96,3,FALSE)","v":"Howes"},null,null,null,null,null,null,null,null,null,null,null,null,"Checks"]
[]
[]
[{"$f":"IF((N32+N33)=0,\"\",\"***ERROR - CALCULATED ADJUSTMENT DOES NOT EQUAL ACTUAL ***\")","v":""}]
["Main Funding Elements"]
[]
["School Budget Share 2022/23",null,null,null,null,{"$f":"'Budget Share Statement'!K62","v":740023.54899769346},null,null,null,null,null,null,null,{"$f":"F12-'Budget Share Statement'!K62","v":0}]
[]
["Indicative Early Years Funding 2022/23* (to be updated)",null,null,null,null,{"$f":"'EYSFF statement'!K29","v":30641.864760000004},null,null,null,null,null,null,null,{"$f":"F14-'EYSFF statement'!K29","v":0}]
[]
[null,null,null,null,null,null,null,{"$f":"SUM(F12,F14)","v":770665.41375769349},null,null,null,null,null,{"$f":"N12+N14","v":0}]
[]
["Other 2022/23 Funding Elements "]
[]
["Indicative Pupil Premium Grant † (excludes LAC & EYPP elements)",null,null,null,null,{"$f":"VLOOKUP((\"P\"&$N$3),[13]Allocations!$A$6:$W$123,22,FALSE)","v":64735}]
{"$rows_left_out":23}
{"sheet":"Budget Share Statement","index":1,"n_rows":66,"n_cols":15,"rows_kept":66,"cut":false,"hidden":true,"merged":[[58,7,58,8],[21,2,21,4],[22,2,22,4],[23,2,23,4],[41,7,41,8],[40,2,40,4],[40,7,40,8],[56,2,56,4],[24,2,24,4],[38,2,38,4],[1,0,1,10],[19,2,19,4],[20,2,20,4],[3,0,3,10],[18,2,18,4],[17,2,17,4],[2,0,2,10],[5,0,5,10],[9,2,9,4],[41,2,41,4],[36,2,36,4],[56,7,56,8],[46,7,46,8],[32,2,32,4],[25,2,25,4],[50,7,50,8]]}
[{"$f":"'Summary of Funding'!A1","v":"Date Issued: 4th July 2022"},null,null,null,null,null,null,null,null,null,{"$f":"'Summary of Funding'!H1","v":"Last amended: 1st July 2022"}]
["COVENTRY CITY COUNCIL"]
[{"$f":"'Summary of Funding'!A3:H3","v":"2022/23 Funding Allocations for Schools"},null,null,null,null,null,null,null,null,null,null,null,null,{"$f":"'Summary of Funding'!N3","v":25}]
["INDICATIVE School Budget Share Statement"]
[]
[{"$f":"VLOOKUP((\"P\"&N3),[5]Formula!$A$10:$X$96,3,FALSE)","v":"Howes"},null,null,null,null,null,null,null,null,null,null," ",null,null,"Checks"]
[null,null,null,null,null,null,null,null,null,null,null," "]
[null,null,null,null,null,null,null,null,null,null,null," "]
[]
["Factors",null,"Factor Measurement",null,null,null,"Number\nof Units",null,"Funding\nPer Unit",null,"Funding \nAllocated"]
[null,null,null,null,null,null,null,null,"£",null,"£"," "]
["Basic Entitlement"]
["Funding",null,"Pupil Number: (Oct-21 Census)",null,null,null,{"$f":"VLOOKUP((\"P\"&$N$3),[10]Data!$A$8:$AH$94,4,FALSE)","v":136},null,{"$f":"[10]Formula!$D$5","v":3238.1940795854794},null,{"$f":"G13*I13","v":440394.39482362522},null,null,null,{"$f":"VLOOKUP((\"P\"&$N$3),[10]Formula!$A$9:$AC$95,4,FALSE)-K13","v":0}]
[]
[null,null,null,null,null,null,null,null,null,null,{"$f":"K13","v":440394.39482362522}]
[]
[]
["Deprivation Funding",null,"IDACI Band G:  Pupil's IDACI < 0.20",null,null,null,{"$f":"VLOOKUP((\"P\"&$N$3),[10]Data!$A$8:$AH$94,22,FALSE)","v":96.999999999999986},null,0,null,{"$f":"G18*I18","v":0}]
[null,null,"IDACI Band F:  0.20 ≤ Pupil's IDACI < 0.25",null,null,null,{"$f":"VLOOKUP((\"P\"&$N$3),[10]Data!$A$8:$AH$94,23,FALSE)","v":25.000000000000039},null,{"$f":"[10]Formula!$N$5","v":220.74359999999999},null,{"$f":"G19*I19","v":5518.5900000000083}," ",null,null,{"$f":"VLOOKUP((\"P\"&$N$3),[10]Formula!$A$9:$AC$95,14,FALSE)-K19","v":0}]
[null,null,"IDACI Band E:  0.25 ≤ Pupil's IDACI < 0.30",null,null,null,{"$f":"VLOOKUP((\"P\"&$N$3),[10]Data!$A$8:$AH$94,24,FALSE)","v":4.9999999999999947},null,{"$f":"[10]Formula!$O$5","v":270.9126},null,1354.5629999999985," ",null,null,{"$f":"VLOOKUP((\"P\"&$N$3),[10]Formula!$A$9:$AC$95,15,FALSE)-K20","v":0}]
{"$rows_left_out":47}
{"sheet":"Minimum Funding Level","index":2,"n_rows":28,"n_cols":14,"rows_kept":28,"cut":false,"hidden":true,"merged":[[11,6,11,7],[19,6,19,7],[21,6,21,7],[16,6,16,7],[1,0,1,10],[2,0,2,10],[3,0,3,10],[5,0,5,10],[8,6,8,7],[9,6,9,7]]}
[{"$f":"'Summary of Funding'!A1","v":"Date Issued: 4th July 2022"},null,null,null,null,null,null,null,null,null,{"$f":"'Summary of Funding'!H1","v":"Last amended: 1st July 2022"}]
["COVENTRY CITY COUNCIL"]
[{"$f":"'Summary of Funding'!A3:H3","v":"2022/23 Funding Allocations for Schools"},null,null,null,null,null,null,null,null,null,null,null,null,{"$f":"'Summary of Funding'!N3","v":25}]
["Calculation of Minimum Per Pupil (MPP) Funding Level"]
[]
[{"$f":"VLOOKUP((\"P\"&N3),[5]Formula!$A$10:$X$96,3,FALSE)","v":"Howes"},null,null,null,null,null,null,null,null,null,null,null,null,"Checks"]
[]
[]
[null,null,null,null,null,null,"£",null,null,"£"]
["NFF Minimum per pupil funding rate",null,null,null,null,null,{"$f":"'[10]Minimum Per Pupil'!$D$3","v":4265},null,null,null,null,null,null,{"$f":"'[10]Minimum Per Pupil'!$D$3-G10","v":0}]
[]
["October 2021 Pupil Numbers",null,null,null,null,null,{"$f":"VLOOKUP((\"P\"&$N$3),'[10]Minimum Per Pupil'!$A$4:$N$91,4,FALSE)","v":136},null,null,null,null,null,null,{"$f":"VLOOKUP((\"P\"&$N$3),'[10]Minimum Per Pupil'!$A$4:$N$91,4,FALSE)-G12","v":0}]
[]
["Minimum Funding Level (MFL)",null,null,null,null,"[A]",null,null,null,{"$f":"G10*G12","v":580040},null,null,null,{"$f":"VLOOKUP((\"P\"&$N$3),'[10]Minimum Per Pupil'!$A$4:$N$91,5,FALSE)-J14","v":0}]
[]
[]
["Total Formula Factor Funding",null,null,null,null,null,{"$f":"'Budget Share Statement'!K45","v":728310.43063448777},null,null,null,null,null,null,{"$f":"VLOOKUP((\"P\"&$N$3),'[10]Minimum Per Pupil'!$A$4:$N$91,7,FALSE)-G17","v":0}]
[]
["Less: exempt premises factors"]
["2022/23 NNDR",null,null,null,null,null,{"$f":"VLOOKUP((\"P\"&$N$3),[10]Formula!$A$10:$AC$95,11,FALSE)","v":34048},null,null,null,null,null,null,{"$f":"VLOOKUP((\"P\"&$N$3),'[10]Minimum Per Pupil'!$A$4:$N$91,8,FALSE)-G20","v":0}]
{"$rows_left_out":9}
{"sheet":"MFG Calculation","index":3,"n_rows":66,"n_cols":14,"rows_kept":66,"cut":false,"hidden":true,"merged":[[29,6,29,7],[15,6,15,7],[58,6,58,7],[60,6,60,7],[10,6,10,7],[49,6,49,7],[17,6,17,7],[53,6,53,7],[33,6,33,7],[51,6,51,7],[47,6,47,7],[42,6,42,7],[1,0,1,10],[2,0,2,10],[3,0,3,10],[5,0,5,10],[19,6,19,7],[40,6,40,7],[8,6,8,7],[13,6,13,7],[27,6,27,7]]}
[{"$f":"'Summary of Funding'!A1","v":"Date Issued: 4th July 2022"},null,null,null,null,null,null,null,null,null,{"$f":"'Summary of Funding'!H1","v":"Last amended: 1st July 2022"}]
["COVENTRY CITY COUNCIL"]
[{"$f":"'Summary of Funding'!A3:H3","v":"2022/23 Funding Allocations for Schools"},null,null,null,null,null,null,null,null,null,null,null,null,{"$f":"'Summary of Funding'!N3","v":25}]
["Calculation of Minimum Funding Guarantee"]
[]
[{"$f":"VLOOKUP((\"P\"&N3),[5]Formula!$A$10:$X$96,3,FALSE)","v":"Howes"},null,null,null,null,null,null,null,null,null,null,null,null,"Checks"]
[]
[]
["Baseline",null,{"$f":"IF(N56>=0,\" \",\"DOES NOT BALANCE\")","v":" "},null,null,null,"£",null,null,"£"]
[]
["Final Budget Share 2021/22 (Excluding Early Years)",null,null,null,null,null,null,null,null,{"$f":"VLOOKUP((\"P\"&$N$3),'[10]Minimum Funding Guarantee'!$A$4:$AK$91,9,FALSE)","v":766710.67266731081}]
[]
["Less:"]
["2021/22 Rates Funding",null,null,null,null,null,{"$f":"VLOOKUP((\"P\"&$N$3),'[10]Minimum Funding Guarantee'!$A$4:$AK$91,11,FALSE)","v":34048},{"$f":"VLOOKUP((\"P\"&$N$3),'[8]Minimum Funding Guarantee'!$A$4:$AK$91,9,FALSE)","v":809720.27666721749}]
[]
["2021/22 Lump Sum",null,null,null,null,null,{"$f":"VLOOKUP((\"P\"&$N$3),'[10]Minimum Funding Guarantee'!$A$4:$AK$91,10,FALSE)","v":121709.99399999999},{"$f":"VLOOKUP((\"P\"&$N$3),'[8]Minimum Funding Guarantee'!$A$4:$AK$91,9,FALSE)","v":809720.27666721749}]
[]
["2021/22 Education Improvement Commissioning Pot",null,null,null,null,null,{"$f":"VLOOKUP((\"P\"&$N$3),'[10]Minimum Funding Guarantee'!$A$4:$AK$91,12,FALSE)","v":1491.6550764953101},{"$f":"VLOOKUP((\"P\"&$N$3),'[8]Minimum Funding Guarantee'!$A$4:$AK$91,9,FALSE)","v":809720.27666721749}]
[]
["2021/22 Split Site",null,null,null,null,null,{"$f":"VLOOKUP((\"P\"&$N$3),'[10]Minimum Funding Guarantee'!$A$4:$AK$91,13,FALSE)","v":0},{"$f":"VLOOKUP((\"P\"&$N$3),'[8]Minimum Funding Guarantee'!$A$4:$AK$91,9,FALSE)","v":809720.27666721749},null,{"$f":"-SUM(G14,G16,G18,G20)","v":-157249.64907649532}]
{"$rows_left_out":47}
{"sheet":"De-delegation","index":4,"n_rows":30,"n_cols":15,"rows_kept":30,"cut":false,"hidden":true,"merged":[[22,2,22,4],[9,2,9,4],[18,2,18,4],[1,0,1,10],[2,0,2,10],[3,0,3,10],[5,0,5,10]]}
[{"$f":"'Summary of Funding'!A1","v":"Date Issued: 4th July 2022"},null,null,null,null,null,null,null,null,null,{"$f":"'Summary of Funding'!H1","v":"Last amended: 1st July 2022"}]
["COVENTRY CITY COUNCIL"]
[{"$f":"'Summary of Funding'!A3:H3","v":"2022/23 Funding Allocations for Schools"},null,null,null,null,null,null,null,null,null,null,null,null,{"$f":"'Summary of Funding'!N3","v":25}]
[{"$f":"\"De-Delegation Detail\"","v":"De-Delegation Detail"}]
[]
[{"$f":"VLOOKUP((\"P\"&N3),[5]Formula!$A$10:$X$96,3,FALSE)","v":"Howes"},null,null,null,null,null,null,null,null,null,null," ",null,null,"Checks"]
[null,null,null,null,null,null,null,null,null,null,null," "]
[null,null,null,null,null,null,null,null,null,null,null," "]
[null,null,null,null,null,null,null,null,null,null,null," "]
["Factors",null,"Factor Measurement",null,null,null,"Number\nof Units",null,"Funding\nPer Unit",null,"Funding \nAllocated"]
[null,null,null,null,null,null,null,null,"£",null,"£"]
["Basic Entitlement"]
["Funding"]
["Maternity Cover",null,"Pupil Number: (Oct-21 Census)",null,null,null,{"$f":"VLOOKUP((\"P\"&$N$3),[10]Data!$A$8:$AH$94,7,FALSE)","v":136},null,{"$f":"-'[10]New Del & De-Del'!$G$9","v":-26.16},null,{"$f":"G14*I14","v":-3557.76},null,null,null,{"$f":"VLOOKUP((\"P\"&N3),'[10]New Del & De-Del'!$A$20:$N$106,11,FALSE)+K14","v":0}]
["Trade Union Facility",null,"Pupil Number: (Oct-21 Census)",null,null,null,{"$f":"VLOOKUP((\"P\"&$N$3),[10]Data!$A$8:$AH$94,7,FALSE)","v":136},null,{"$f":"-'[10]New Del & De-Del'!$G$10","v":-4},null,{"$f":"G15*I15","v":-544},null,null,null,{"$f":"VLOOKUP((\"P\"&N3),'[10]New Del & De-Del'!$A$20:$N$106,12,FALSE)+K15","v":0}]
[]
[null,null,null,null,null,null,null,null,null,null,{"$f":"SUM(K14:K15)","v":-4101.76},null,null,null,{"$f":"VLOOKUP((\"P\"&N3),'[10]New Del & De-Del'!$A$20:$N$106,4,FALSE)+K17","v":0}]
["Deprivation Funding"]
["Free School Meal Eligibility",null,"Free School Meals: (Oct-21 FSM Eligibility)",null,null,null,{"$f":"VLOOKUP((\"P\"&$N$3),[10]Data!$A$8:$AH$94,20,FALSE)","v":44.000000000000014},null,{"$f":"-'[10]New Del & De-Del'!$G$7","v":-2.8446061144570325},null,{"$f":"G19*I19","v":-125.16266903610946},null,null,null,{"$f":"VLOOKUP((\"P\"&N3),'[10]New Del & De-Del'!$A$20:$N$106,5,FALSE)+K19","v":0}]
[]
{"$rows_left_out":11}
{"sheet":"EYSFF statement","index":5,"n_rows":40,"n_cols":14,"rows_kept":40,"cut":false,"hidden":true,"merged":[[1,0,1,10],[2,0,2,10],[3,0,3,10],[5,0,5,10]]}
[{"$f":"'Summary of Funding'!A1","v":"Date Issued: 4th July 2022"},null,null,null,null,null,null,null,null,null,{"$f":"'Summary of Funding'!H1","v":"Last amended: 1st July 2022"}]
["COVENTRY CITY COUNCIL"]
[{"$f":"'Summary of Funding'!A3:H3","v":"2022/23 Funding Allocations for Schools"},null,null,null,null,null,null,null,null,null,null,null,null,{"$f":"'Summary of Funding'!N3","v":25}]
["INDICATIVE Early Years Funding Statement"]
[]
[{"$f":"VLOOKUP((\"P\"&N3),[5]Formula!$A$10:$X$96,3,FALSE)","v":"Howes"},null,null,null,null,null,null,null,null,null,null,null,null,"Checks"]
[]
[]
["School Data"]
[]
["IDACI based on January 2022 census",null,null,null,null,null,{"$f":"VLOOKUP((\"P\"&$N$3),'[10]Early Years Formula'!$A$10:$H$93,5,FALSE)","v":0.12090000000000001}]
["2022-23 Base Rate",null,null,null,null,null,{"$f":"VLOOKUP((\"P\"&$N$3),'[10]Early Years Formula'!$A$10:$H$93,6,FALSE)","v":4.21}]
["2022-23 Deprivation Rate",null,null,null,null,null,{"$f":"VLOOKUP((\"P\"&$N$3),'[10]Early Years Formula'!$A$10:$H$93,7,FALSE)","v":1.26}]
[]
[]
[null,null,null,null,"Summer \nTerm 2022",null,"Autumn\nTerm 2022",null,"Spring\nTerm 2023",null,"Whole\nFinancial Year"]
[null,null,null,null,"(12 Weeks)",null,"(14 Weeks)",null,"(12 Weeks)",null,"(38 Weeks)"]
[null,null,null,null,"(Per May 22 census)",null,"(Per Oct 21 census)",null,"(Per Jan 22 census)"]
["Formula Factors",null,null,null,"Updated",null,"To be updated",null,"To be updated"]
["Free Entitlement Headcount",null,null,null,{"$f":"VLOOKUP((\"P\"&$N$3),'[10]Early Years Formula'!$A$10:$O$93,9,FALSE)","v":12},null,{"$f":"VLOOKUP((\"P\"&$N$3),'[10]Early Years Formula'!$A$10:$AD$93,16,FALSE)","v":8},null,{"$f":"VLOOKUP((\"P\"&$N$3),'[10]Early Years Formula'!$A$10:$AD$93,23,FALSE)","v":12}]
{"$rows_left_out":21}
{"sheet":"Further Delegation Info","index":6,"n_rows":26,"n_cols":14,"rows_kept":26,"cut":false,"hidden":true,"merged":[[3,0,3,7],[4,0,4,7],[5,0,5,7],[6,0,6,7],[8,0,9,7],[1,0,1,7],[10,0,13,7],[16,0,17,0],[16,1,17,1],[16,2,16,4],[16,5,16,7],[2,0,2,7]]}
[{"$f":"'Summary of Funding'!A1","v":"Date Issued: 4th July 2022"},null,null,null,null,null,null,{"$f":"'Summary of Funding'!H1","v":"Last amended: 1st July 2022"},null,null,null,null,null,"ID"]
["COVENTRY CITY COUNCIL"]
[{"$f":"'Summary of Funding'!A3:H3","v":"2022/23 Funding Allocations for Schools"}]
["Further Delegation Information"]
[]
["All Schools"]
[]
[]
["The 2013/14 School Funding Reform required local authorities to delegate some centrally retained DSG budgets to schools; those budgets are listed below in the columns headed \"Delegated in 2013/14\" for your information.\n"]
[]
["For 2022/23 maintained schools have opted to return some of this funding to the Local Authority to continue central provision of the relevant services. The delegated budget available to each maintained school therefore excludes these returned budgets. The relevant amounts are listed below in the columns headed \"De-delegation in 2021/22\" for your reference."]
[]
[]
[]
[]
[]
["S251 line","Further Delegation Areas","Delegated in 2013/14",null,null,"De-delegation in 2022/23"]
[null,null,"Primary\n(all)\n£","Secondary\n(all)\n£","Total\n(all)\n£","Primary\nMaintained\n£","Secondary\nMaintained\n£","Total\nMaintained\n£"]
["1.1.4","Free school meal eligibility",20899.321122915815,11151.538623932094,32050.859746847909,{"$f":"'[11]New Del & De-Del'!$I$7","v":13750.825957285297},0,{"$f":"SUM(F19:G19)","v":13750.825957285297}]
["1.1.7","Licences/subscriptions",56639.723182411013,35735.642889017559,92375.36607142858,{"$f":"'[11]New Del & De-Del'!$I$8","v":0},0,{"$f":"SUM(F20:G20)","v":0}]
{"$rows_left_out":7}
{"sheet":"ISB","index":7,"n_rows":45,"n_cols":10,"rows_kept":45,"cut":false,"hidden":true,"merged":[[1,0,1,5],[2,0,2,5],[4,0,4,5],[7,0,11,5]]}
[{"$f":"'Summary of Funding'!A1","v":"Date Issued: 4th July 2022"},null,null,null,null,{"$f":"'Summary of Funding'!H1","v":"Last amended: 1st July 2022"},null,null,null,"ID"]
["COVENTRY CITY COUNCIL"]
["2022/23 Funding Allocations for Schools"]
[]
["Individual Schools Budget (ISB) 2022/23"]
[]
[]
["This page shows how the Individual Schools Budget (ISB), which is the total of all schools block delegated budget shares, has changed from the previous year. It shows the financial effect, in overall budget terms, of policy and funding decisions in terms of the increased or decreased level of resources for schools. The final ISB figure represents the total level of resources which go into the Fair Funding Formula to produce schools budget shares."]
[]
[]
[]
[]
[]
[null,null,"Schools ","Schools"]
[null,null,"Block","Block"]
[null,null,"(Primary)","(Secondary)"]
[null,null,"£","£"]
[]
[null,"FINAL ISB 2021/22",{"$f":"'[12]PPR (New Blocks)'!$E$9","v":142688600.80349195},{"$f":"'[12]PPR (New Blocks)'!$F$9","v":119603664.55763626}]
[]
{"$rows_left_out":26}
{"sheet":"LogIn","index":8,"n_rows":85,"n_cols":3,"rows_kept":85,"cut":false,"hidden":true,"merged":[]}
["User Name","Password","ID"]
["Alderman's Green ","NcR96N",1]
["Aldermoor Farm","8UBcN4",2]
["Allesley","uE98HX",3]
["Allesley Hall","c2r66H",4]
["Broad Heath","94ctnJ",5]
["Cannon Park","4V8gK4",6]
["Charter","bHkpG8",7]
["Clifford Bridge ","VksmRa1a",8]
["Coundon Primary","4Y428c",9]
["Courthouse Green","BE75nX1a",10]
["Earlsdon","ZkcST6",11]
["Eastern Green Junior","24x4Xc",12]
["Edgewick","R3kRR4",13]
["Ernesford Grange","GKD5A2",14]
["Finham","9TWJzm1a",15]
["Frederick Bird","agw9kd",16]
["Gosford Park ","cuxXcd",17]
["Grange Farm","V2DGxe",18]
["Grangehurst","aFbkW3",19]
{"$rows_left_out":66}
{"sheet":"LoginPage","index":9,"n_rows":0,"n_cols":0,"rows_kept":0,"cut":false,"hidden":false,"merged":[]}

{"sheet":"Funding Floor","index":10,"n_rows":42,"n_cols":14,"rows_kept":42,"cut":false,"hidden":true,"merged":[[1,0,1,11],[2,0,2,11],[3,0,3,11],[5,0,5,11],[15,8,15,9],[17,8,17,9],[19,8,19,9],[33,8,33,9],[8,8,8,9],[31,8,31,9],[21,8,21,9],[26,8,26,9],[13,8,13,9]]}
[{"$f":"'Summary of Funding'!A1","v":"Date Issued: 4th July 2022"},null,null,null,null,null,null,null,null,null,null,{"$f":"'Summary of Funding'!H1","v":"Last amended: 1st July 2022"}]
["COVENTRY CITY COUNCIL - PEOPLE'S DIRECTORATE"]
[{"$f":"'Summary of Funding'!A3:H3","v":"2022/23 Funding Allocations for Schools"},null,null,null,null,null,null,null,null,null,null,null,null,{"$f":"'Summary of Funding'!N3","v":25}]
["Calculation of Funding Floor"]
[]
[{"$f":"VLOOKUP((\"P\"&N3),[5]Formula!$A$10:$X$96,3,FALSE)","v":"Howes"},null,null,null,null,null,null,null,null,null,null,null,null,"Checks"]
[]
[]
[null,null,null,null,null,null,null,null,"£",null,null,"£"]
[]
["2020/21 Total funding allocated after MFL",null,null,null,null,null,null,null,null,null,null,{"$f":"VLOOKUP((\"P\"&$N$3),'[7]Funding Floor'!$A$3:$U$90,6,FALSE)","v":775536.03023775283},null,{"$f":"VLOOKUP((\"P\"&$N$3),'[7]Funding Floor'!$A$3:$U$90,6,FALSE)-L11","v":0}]
[]
["Less: "]
["2020/21 Mobility",null,null,null,null,null,null,null,{"$f":"VLOOKUP((\"P\"&$N$3),'[7]Funding Floor'!$A$3:$U$90,7,FALSE)","v":750.75168349314936},{"$f":"VLOOKUP((\"P\"&$N$3),'[7]Funding Floor'!$A$3:$U$90,6,FALSE)","v":775536.03023775283},null,null,null,{"$f":"VLOOKUP((\"P\"&$N$3),'[7]Funding Floor'!$A$3:$U$90,7,FALSE)-I14","v":0}]
[]
["2020/21 Lump Sum",null,null,null,null,null,null,null,{"$f":"VLOOKUP((\"P\"&$N$3),'[7]Funding Floor'!$A$3:$U$90,8,FALSE)","v":110364.09999999999},{"$f":"VLOOKUP((\"P\"&$N$3),'[7]Funding Floor'!$A$3:$U$90,6,FALSE)","v":775536.03023775283},null,null,null,{"$f":"VLOOKUP((\"P\"&$N$3),'[7]Funding Floor'!$A$3:$U$90,8,FALSE)-I16","v":0}]
[]
["2020/21 Split Site",null,null,null,null,null,null,null,{"$f":"VLOOKUP((\"P\"&$N$3),'[7]Funding Floor'!$A$3:$U$90,9,FALSE)","v":0},{"$f":"VLOOKUP((\"P\"&$N$3),'[7]Funding Floor'!$A$3:$U$90,6,FALSE)","v":775536.03023775283},null,null,null,{"$f":"VLOOKUP((\"P\"&$N$3),'[7]Funding Floor'!$A$3:$U$90,9,FALSE)-I18","v":0}]
[]
["2020/21 Rates Funding",null,null,null,null,null,null,null,{"$f":"VLOOKUP((\"P\"&$N$3),'[7]Funding Floor'!$A$3:$U$90,11,FALSE)","v":33516},{"$f":"VLOOKUP((\"P\"&$N$3),'[7]Funding Floor'!$A$3:$U$90,6,FALSE)","v":775536.03023775283},null,null,null,{"$f":"VLOOKUP((\"P\"&$N$3),'[7]Funding Floor'!$A$3:$U$90,11,FALSE)-I20","v":0}]
{"$rows_left_out":22}