{"text_format":"1","workbook":"xlsx","n_sheets":11,"sheets":["Summary of Funding","Budget Share Statement","Minimum Funding Level","MFG Calculation","De-delegation","EYSFF statement","Further Delegation Info","ISB","LogIn","LoginPage","Funding Floor"],"not_rendered":{"charts":0,"images":0,"macros":1,"external_links":19,"defined_names":22,"comments":0,"pivot_tables":0},"unopened":[],"bounds":{"document_bytes":16777216,"sheet_cells":100000,"rows_first":2000,"rows_last":500,"rows_between":2000,"halvings":0,"cell_chars":16384,"cell_head_chars":4096},"cells_cut":0,"cells_raw":0,"read":"whole","date_system":"1900"}

{"sheet":"Summary of Funding","index":0,"n_rows":47,"n_cols":14,"rows_kept":47,"cut":false,"hidden":true,"merged":[[17,0,17,3],[2,0,2,7],[3,0,3,7],[5,0,5,7],[1,0,1,7],[9,0,9,2]]}
["Date Issued: 28th March 2024",null,null,null,null,null,null,"Last amended: 29th February 2024"]
["COVENTRY CITY COUNCIL"]
["2024/25 Funding Allocations for Schools",null,null,null,null,null,null,null,null,null,null,null,null,3]
["INDICATIVE Summary of Funding"]
[]
[{"$f":"_xlfn.XLOOKUP(\"P\"&$N$3,'[5]Minimum Funding Guarantee'!$A:$A,'[5]Minimum Funding Guarantee'!$C:$C)","v":"Allesley Primary School"},null,null,null,null,null,null,null,null,null,null,null,null,"Checks"]
[]
[]
[{"$f":"IF((N34+N35)=0,\"\",\"***ERROR - CALCULATED ADJUSTMENT DOES NOT EQUAL ACTUAL ***\")","v":""}]
["Main Funding Elements"]
[]
["School Budget Share 2024/25",null,null,null,null,{"$f":"'Budget Share Statement'!K58","v":1746326.8629633444},null,null,null,null,null,null,null,{"$f":"F12-'Budget Share Statement'!K58","v":0}]
[]
["Indicative Early Years Funding 2024/25* (to be updated)",null,null,null,null,{"$f":"'EYSFF statement'!K30","v":153175.92674999998},null,null,null,null,null,null,null,{"$f":"F14-'EYSFF statement'!K30","v":0}]
[]
[null,null,null,null,null,null,null,{"$f":"SUM(F12,F14)","v":1899502.7897133445},null,null,null,null,null,{"$f":"N12+N14","v":0}]
[]
["Other 2024/25 Funding Elements "]
[]
["Indicative Pupil Premium Grant † (excludes LAC & EYPP elements)",null,null,null,null,{"$f":"_xlfn.XLOOKUP(\"P\"&$N$3,[6]Allocations!$A$1:$A$65536,[6]Allocations!$U$1:$U$65536)","v":58340}]
{"$rows_left_out":28}
{"sheet":"Budget Share Statement","index":1,"n_rows":62,"n_cols":15,"rows_kept":62,"cut":false,"hidden":true,"merged":[[1,0,1,10],[18,2,18,4],[19,2,19,4],[3,0,3,10],[17,2,17,4],[16,2,16,4],[2,0,2,10],[5,0,5,10],[9,2,9,4],[55,7,55,8],[20,2,20,4],[21,2,21,4],[22,2,22,4],[23,2,23,4],[53,7,53,8],[39,2,39,4],[39,7,39,8],[51,2,51,4],[24,2,24,4],[47,7,47,8],[37,2,37,4],[31,2,31,4],[35,2,35,4],[51,7,51,8],[43,7,43,8]]}
[{"$f":"'Summary of Funding'!A1","v":"Date Issued: 28th March 2024"},null,null,null,null,null,null,null,null,null,{"$f":"'Summary of Funding'!H1","v":"Last amended: 29th February 2024"}]
["COVENTRY CITY COUNCIL"]
[{"$f":"'Summary of Funding'!A3:H3","v":"2024/25 Funding Allocations for Schools"},null,null,null,null,null,null,null,null,null,null,null,null,{"$f":"'Summary of Funding'!N3","v":3}]
["INDICATIVE School Budget Share Statement"]
[]
[{"$f":"_xlfn.XLOOKUP(\"P\"&$N$3,'[5]Minimum Funding Guarantee'!$A:$A,'[5]Minimum Funding Guarantee'!$C:$C)","v":"Allesley Primary School"},null,null,null,null,null,null,null,null,null,null," ",null,null,"Checks"]
[null,null,null,null,null,null,null,null,null,null,null," "]
[null,null,null,null,null,null,null,null,null,null,null," "]
[]
["Factors",null,"Factor Measurement",null,null,null,"Number\nof Units",null,"Funding\nPer Unit",null,"Funding \nAllocated"]
[null,null,null,null,null,null,null,null,"£",null,"£"," "]
["Basic Entitlement"]
["Funding",null,"Pupil Number: (Oct-23 Census)",null,null,null,{"$f":"_xlfn.XLOOKUP(\"P\"&$N$3,[11]Data!$A:$A,[11]Data!$G:$G)","v":382},null,{"$f":"[11]Formula!$D$2","v":3574.5026199999998},null,{"$f":"G13*I13","v":1365460.0008399999},null,null,null,{"$f":"_xlfn.XLOOKUP(\"P\"&$N$3,[11]Formula!$A:$A,[11]Formula!$D:$D)-K13","v":0}]
[]
[null,null,null,null,null,null,null,null,null,null,{"$f":"K13","v":1365460.0008399999}]
[]
["Deprivation Funding",null,"IDACI Band G:  Pupil's IDACI < 0.20",null,null,null,{"$f":"_xlfn.XLOOKUP(\"P\"&$N$3,[11]Data!$A:$A,[11]Data!$V:$V)","v":351.99999999999983},null,0,null,{"$f":"G17*I17","v":0}]
[null,null,"IDACI Band F:  0.20 ≤ Pupil's IDACI < 0.25",null,null,null,{"$f":"_xlfn.XLOOKUP(\"P\"&$N$3,[11]Data!$A:$A,[11]Data!$W:$W)","v":9.0000000000000124},null,{"$f":"[11]Formula!$N$2","v":235.82484999999997},null,{"$f":"G18*I18","v":2122.4236500000025}," ",null,null,{"$f":"_xlfn.XLOOKUP(\"P\"&$N$3,[11]Formula!$A:$A,[11]Formula!$N:$N)-K18","v":0}]
[null,null,"IDACI Band E:  0.25 ≤ Pupil's IDACI < 0.30",null,null,null,{"$f":"_xlfn.XLOOKUP(\"P\"&$N$3,[11]Data!$A:$A,[11]Data!$X:$X)","v":12.999999999999982},null,{"$f":"[11]Formula!$O$2","v":286.00034999999997},null,3718.0045499999947," ",null,null,{"$f":"_xlfn.XLOOKUP(\"P\"&$N$3,[11]Formula!$A:$A,[11]Formula!$O:$O)-K19","v":0}]
[null,null,"IDACI Band D:  0.30 ≤ Pupil's IDACI < 0.35",null,null,null,{"$f":"_xlfn.XLOOKUP(\"P\"&$N$3,[11]Data!$A:$A,[11]Data!$Y:$Y)","v":5.0000000000000018},null,{"$f":"[11]Formula!$P$2","v":446.56194999999997},null,2232.8097500000008," ",null,null,{"$f":"_xlfn.XLOOKUP(\"P\"&$N$3,[11]Formula!$A:$A,[11]Formula!$P:$P)-K20","v":0}]
{"$rows_left_out":43}
{"sheet":"Minimum Funding Level","index":2,"n_rows":28,"n_cols":14,"rows_kept":28,"cut":false,"hidden":true,"merged":[[11,6,11,7],[19,6,19,7],[21,6,21,7],[16,6,16,7],[1,0,1,10],[2,0,2,10],[3,0,3,10],[5,0,5,10],[8,6,8,7],[9,6,9,7]]}
[{"$f":"'Summary of Funding'!A1","v":"Date Issued: 28th March 2024"},null,null,null,null,null,null,null,null,null,{"$f":"'Summary of Funding'!H1","v":"Last amended: 29th February 2024"}]
["COVENTRY CITY COUNCIL"]
[{"$f":"'Summary of Funding'!A3:H3","v":"2024/25 Funding Allocations for Schools"},null,null,null,null,null,null,null,null,null,null,null,null,{"$f":"'Summary of Funding'!N3","v":3}]
["Calculation of Minimum Per Pupil (MPP) Funding Level"]
[]
[{"$f":"_xlfn.XLOOKUP(\"P\"&$N$3,'[5]Minimum Funding Guarantee'!$A:$A,'[5]Minimum Funding Guarantee'!$C:$C)","v":"Allesley Primary School"},null,null,null,null,null,null,null,null,null,null,null,null,"Checks"]
[]
[]
[null,null,null,null,null,null,"£",null,null,"£"]
["NFF Minimum per pupil funding rate",null,null,null,null,null,{"$f":"'[11]Minimum Per Pupil'!$D$3","v":4610},null,null,null,null,null,null,{"$f":"'[11]Minimum Per Pupil'!$D$3-G10","v":0}]
[]
["October 2023 Pupil Numbers",null,null,null,null,null,{"$f":"_xlfn.XLOOKUP(\"P\"&$N$3,'[11]Minimum Per Pupil'!$A:$A,'[11]Minimum Per Pupil'!$D:$D)","v":382},null,null,null,null,null,null,{"$f":"_xlfn.XLOOKUP(\"P\"&$N$3,'[11]Minimum Per Pupil'!$A:$A,'[11]Minimum Per Pupil'!$D:$D)-G12","v":0}]
[]
["Minimum Funding Level (MFL)",null,null,null,null,"[A]",null,null,null,{"$f":"G10*G12","v":1761020},null,null,null,{"$f":"_xlfn.XLOOKUP(\"P\"&$N$3,'[11]Minimum Per Pupil'!$A:$A,'[11]Minimum Per Pupil'!$E:$E)-J14","v":0}]
[]
[]
["Total Formula Factor Funding",null,null,null,null,null,{"$f":"'Budget Share Statement'!K42","v":1743385.0994256767},null,null,null,null,null,null,{"$f":"_xlfn.XLOOKUP(\"P\"&$N$3,'[11]Minimum Per Pupil'!$A:$A,'[11]Minimum Per Pupil'!$G:$G)-G17","v":0}]
[]
["Less: exempt premises factors"]
["2024/25 NNDR",null,null,null,null,null,{"$f":"_xlfn.XLOOKUP(\"P\"&$N$3,[11]Formula!$A:$A,[11]Formula!$K:$K)","v":53760},{"$f":"INDEX([13]Formula!$K:$K,MATCH(\"P\"&$N$3,[13]Formula!$A:$A,0))-A20","v":{"$error":"#VALUE!"}},null,null,null,null,null,{"$f":"_xlfn.XLOOKUP(\"P\"&$N$3,[11]Formula!$A:$A,[11]Formula!$K:$K)-G20","v":0}]
{"$rows_left_out":9}
{"sheet":"MFG Calculation","index":3,"n_rows":65,"n_cols":14,"rows_kept":65,"cut":false,"hidden":true,"merged":[[1,0,1,10],[2,0,2,10],[3,0,3,10],[5,0,5,10],[17,6,17,7],[8,6,8,7],[57,6,57,7],[59,6,59,7],[10,6,10,7],[49,6,49,7],[15,6,15,7],[29,6,29,7],[13,6,13,7],[27,6,27,7],[51,6,51,7],[42,6,42,7],[47,6,47,7],[33,6,33,7],[40,6,40,7],[20,6,20,7]]}
[{"$f":"'Summary of Funding'!A1","v":"Date Issued: 28th March 2024"},null,null,null,null,null,null,null,null,null,{"$f":"'Summary of Funding'!H1","v":"Last amended: 29th February 2024"}]
["COVENTRY CITY COUNCIL"]
[{"$f":"'Summary of Funding'!A3:H3","v":"2024/25 Funding Allocations for Schools"},null,null,null,null,null,null,null,null,null,null,null,null,{"$f":"'Summary of Funding'!N3","v":3}]
["Calculation of Minimum Funding Guarantee"]
[]
[{"$f":"_xlfn.XLOOKUP(\"P\"&$N$3,[5]Formula!$A:$A,[5]Formula!$C:$C)","v":"Allesley Primary School"},null,null,null,null,null,null,null,null,null,null,null,null,"Checks"]
[]
[]
["Baseline",null,{"$f":"IF(N55>=0,\" \",\"DOES NOT BALANCE\")","v":" "},null,null,null,"£",null,null,"£"]
[]
["Final Budget Share 2023/24 (Excluding Early Years)",null,null,null,null,null,null,null,null,{"$f":"_xlfn.XLOOKUP(\"P\"&$N$3,'[11]Minimum Funding Guarantee'!$A:$A,'[11]Minimum Funding Guarantee'!$H:$H)","v":1600252.5777664001}]
[]
["Less:"]
["2023/24 Rates Funding",null,null,null,null,null,{"$f":"_xlfn.XLOOKUP(\"P\"&$N$3,'[11]Minimum Funding Guarantee'!$A:$A,'[11]Minimum Funding Guarantee'!$J:$J)","v":45824},{"$f":"_xlfn.XLOOKUP(\"P\"&$N$3,'[11]Minimum Funding Guarantee'!$A:$A,'[11]Minimum Funding Guarantee'!$H:$H)","v":1600252.5777664001}]
[]
["2024/25 Lump Sum",null,null,null,null,null,{"$f":"_xlfn.XLOOKUP(\"P\"&$N$3,'[11]Minimum Funding Guarantee'!$A:$A,'[11]Minimum Funding Guarantee'!$I:$I)","v":134871.74399999998},{"$f":"INDEX('[13]Minimum Funding Guarantee'!$H:$H,MATCH(\"P\"&$N$3,'[13]Minimum Funding Guarantee'!$A:$A,0))","v":1596002.9570200001}]
[]
["2023/24 Split Site",null,null,null,null,null,{"$f":"_xlfn.XLOOKUP(\"P\"&$N$3,'[12]Minimum Funding Guarantee'!$A:$A,'[12]Minimum Funding Guarantee'!$L:$L)","v":0},{"$f":"INDEX('[13]Minimum Funding Guarantee'!$H:$H,MATCH(\"P\"&$N$3,'[13]Minimum Funding Guarantee'!$A:$A,0))","v":1596002.9570200001},null,{"$f":"-SUM(G14,G16,G18)","v":-180695.74399999998}]
[]
["Add:"]
{"$rows_left_out":46}
{"sheet":"De-delegation","index":4,"n_rows":25,"n_cols":15,"rows_kept":25,"cut":false,"hidden":true,"merged":[[22,2,22,4],[9,2,9,4],[18,2,18,4],[1,0,1,10],[2,0,2,10],[3,0,3,10],[5,0,5,10]]}
[{"$f":"'Summary of Funding'!A1","v":"Date Issued: 28th March 2024"},null,null,null,null,null,null,null,null,null,{"$f":"'Summary of Funding'!H1","v":"Last amended: 29th February 2024"}]
["COVENTRY CITY COUNCIL"]
[{"$f":"'Summary of Funding'!A3:H3","v":"2024/25 Funding Allocations for Schools"},null,null,null,null,null,null,null,null,null,null,null,null,{"$f":"'Summary of Funding'!N3","v":3}]
[{"$f":"\"De-Delegation Detail\"","v":"De-Delegation Detail"}]
[]
[{"$f":"_xlfn.XLOOKUP(\"P\"&$N$3,[5]Formula!$A:$A,[5]Formula!$C:$C)","v":"Allesley Primary School"},null,null,null,null,null,null,null,null,null,null," ",null,null,"Checks"]
[null,null,null,null,null,null,null,null,null,null,null," "]
[null,null,null,null,null,null,null,null,null,null,null," "]
[null,null,null,null,null,null,null,null,null,null,null," "]
["Factors",null,"Factor Measurement",null,null,null,"Number\nof Units",null,"Funding\nPer Unit",null,"Funding \nAllocated"]
[null,null,null,null,null,null,null,null,"£",null,"£"]
["Basic Entitlement"]
["Funding"]
["Maternity Cover",null,"Pupil Number: (Oct-23 Census)",null,null,null,{"$f":"_xlfn.XLOOKUP(\"P\"&$N$3,[11]Data!$A:$A,[11]Data!$D:$D)","v":382},null,{"$f":"-'[11]New Del & De-Del'!$G$9","v":-29.010664596926969},null,{"$f":"G14*I14","v":-11082.073876026103},null,null,null,{"$f":"ROUND(_xlfn.XLOOKUP(\"P\"&$N$3,'[11]New Del & De-Del'!$A:$A,'[11]New Del & De-Del'!$K:$K)+K14,0)","v":0}]
["Trade Union Facility",null,"Pupil Number: (Oct-23 Census)",null,null,null,{"$f":"_xlfn.XLOOKUP(\"P\"&$N$3,[11]Data!$A:$A,[11]Data!$D:$D)","v":382},null,{"$f":"-'[11]New Del & De-Del'!$G$10","v":-4},null,{"$f":"G15*I15","v":-1528},null,null,null,{"$f":"ROUND(_xlfn.XLOOKUP(\"P\"&$N$3,'[11]New Del & De-Del'!$A:$A,'[11]New Del & De-Del'!$L:$L)+K15,0)","v":0}]
[]
[null,null,null,null,null,null,null,null,null,null,{"$f":"SUM(K14:K15)","v":-12610.073876026103},null,null,null,{"$f":"ROUND(_xlfn.XLOOKUP(\"P\"&$N$3,'[11]New Del & De-Del'!$A:$A,'[11]New Del & De-Del'!$D:$D)+K17,0)","v":0}]
["Deprivation Funding"]
["Free School Meal Eligibility",null,"Free School Meals: (Oct-23 FSM Eligibility)",null,null,null,{"$f":"_xlfn.XLOOKUP(\"P\"&$N$3,[11]Data!$A:$A,[11]Data!$T:$T)","v":28.999999999999982},null,{"$f":"-'[11]New Del & De-Del'!$G$7","v":-2.6331512061126139},null,{"$f":"G19*I19","v":-76.361384977265757},null,null,null,{"$f":"ROUND(_xlfn.XLOOKUP(\"P\"&$N$3,'[11]New Del & De-Del'!$A:$A,'[11]New Del & De-Del'!$E:$E)+K19,0)","v":0}]
[]
{"$rows_left_out":6}
{"sheet":"EYSFF statement","index":5,"n_rows":42,"n_cols":14,"rows_kept":42,"cut":false,"hidden":true,"merged":[[1,0,1,10],[2,0,2,10],[3,0,3,10],[5,0,5,10],[8,4,8,6],[8,8,8,10]]}
[{"$f":"'Summary of Funding'!A1","v":"Date Issued: 28th March 2024"},null,null,null,null,null,null,null,null,null,{"$f":"'Summary of Funding'!H1","v":"Last amended: 29th February 2024"}]
["COVENTRY CITY COUNCIL"]
[{"$f":"'Summary of Funding'!A3:H3","v":"2024/25 Funding Allocations for Schools"},null,null,null,null,null,null,null,null,null,null,null,null,{"$f":"'Summary of Funding'!N3","v":3}]
["INDICATIVE Early Years Funding Statement"]
[]
[{"$f":"_xlfn.XLOOKUP(\"P\"&$N$3,[5]Formula!$A:$A,[5]Formula!$C:$C)","v":"Allesley Primary School"},null,null,null,null,null,null,null,null,null,null,null,null,"Checks"]
[]
[]
["School Data",null,null,null,"Early Years Rates"]
[null,null,null,null,"Free Entitlement",null,"Extended Entitlement"]
["January 2023 Headcount ",null,null,null,{"$f":"_xlfn.IFNA(_xlfn.XLOOKUP(\"P\"&$N$3,'[15]Early Years Formula'!$A:$A,'[15]Early Years Formula'!$D:$D),0)","v":32},null,{"$f":"_xlfn.IFNA(_xlfn.XLOOKUP(\"P\"&$N$3,'[15]Early Years Formula'!$A:$A,'[15]Early Years Formula'!$D:$D),0)","v":32}]
["IDACI based on January 2023 census",null,null,null,{"$f":"_xlfn.IFNA(_xlfn.XLOOKUP(\"P\"&$N$3,'[15]Early Years Formula'!$A:$A,'[15]Early Years Formula'!$E:$E),0)","v":9.6718750000000034E-2},null,{"$f":"_xlfn.IFNA(_xlfn.XLOOKUP(\"P\"&$N$3,'[15]Early Years Formula'!$A:$A,'[15]Early Years Formula'!$E:$E),0)","v":9.6718750000000034E-2}]
["Universal Base Rate",null,null,null,4.93,null,4.93]
["Universal Deprivation Rate",null,null,null,1.48,null,1.48]
[]
[]
[null,null,null,null,"Summer \nTerm 2024",null,"Autumn\nTerm 2024",null,"Spring\nTerm 2025",null,"Whole\nFinancial Year"]
[null,null,null,null,"(12 Weeks)",null,"(14 Weeks)",null,"(12 Weeks)",null,"(38 Weeks)"]
[null,null,null,null,"(Per May 23 census)",null,"(Per Oct 23 census)",null,"(Per Jan 24 census)"]
["Formula Factors"]
{"$rows_left_out":23}
{"sheet":"Further Delegation Info","index":6,"n_rows":26,"n_cols":14,"rows_kept":26,"cut":false,"hidden":true,"merged":[[10,0,13,7],[16,0,17,0],[16,1,17,1],[16,2,16,4],[16,5,16,7],[8,0,9,7],[1,0,1,7],[2,0,2,7],[3,0,3,7],[4,0,4,7],[5,0,5,7],[6,0,6,7]]}
[{"$f":"'Summary of Funding'!A1","v":"Date Issued: 28th March 2024"},null,null,null,null,null,null,{"$f":"'Summary of Funding'!H1","v":"Last amended: 29th February 2024"},null,null,null,null,null,"ID"]
["COVENTRY CITY COUNCIL"]
[{"$f":"'Summary of Funding'!A3:H3","v":"2024/25 Funding Allocations for Schools"}]
["Further Delegation Information"]
[]
["All Schools"]
[]
[]
["The 2013/14 School Funding Reform required local authorities to delegate some centrally retained DSG budgets to schools; those budgets are listed below in the columns headed \"Delegated in 2013/14\" for your information.\n"]
[]
["For 2024/25 maintained schools have opted to return some of this funding to the Local Authority to continue central provision of the relevant services. The delegated budget available to each maintained school therefore excludes these returned budgets. The relevant amounts are listed below in the columns headed \"De-delegation in 2024/25\" for your reference."]
[]
[]
[]
[]
[]
["S251 line","Further Delegation Areas","Delegated in 2013/14",null,null,"De-delegation in 2024/25"]
[null,null,"Primary\n(all)\n£","Secondary\n(all)\n£","Total\n(all)\n£","Primary\nMaintained\n£","Secondary\nMaintained\n£","Total\nMaintained\n£"]
["1.1.4","Free school meal eligibility",20899.321122915815,11151.538623932094,32050.859746847909,{"$f":"'[11]New Del & De-Del'!I7","v":12720.753476730019},0,{"$f":"SUM(F19:G19)","v":12720.753476730019}]
["1.1.7","Licences/subscriptions",56639.723182411013,35735.642889017559,92375.36607142858,{"$f":"'[11]New Del & De-Del'!I8","v":0},0,{"$f":"SUM(F20:G20)","v":0}]
{"$rows_left_out":7}
{"sheet":"ISB","index":7,"n_rows":35,"n_cols":10,"rows_kept":35,"cut":false,"hidden":true,"merged":[[1,0,1,5],[2,0,2,5],[4,0,4,5],[7,0,11,5]]}
[{"$f":"'Summary of Funding'!A1","v":"Date Issued: 28th March 2024"},null,null,null,null,{"$f":"'Summary of Funding'!H1","v":"Last amended: 29th February 2024"},null,null,null,"ID"]
["COVENTRY CITY COUNCIL"]
["2023/24 Funding Allocations for Schools"]
[]
["Individual Schools Budget (ISB) 2023/24"]
[]
[]
["This page shows how the Individual Schools Budget (ISB), which is the total of all schools block delegated budget shares, has changed from the previous year. It shows the financial effect, in overall budget terms, of policy and funding decisions in terms of the increased or decreased level of resources for schools. The final ISB figure represents the total level of resources which go into the Fair Funding Formula to produce schools budget shares."]
[]
[]
[]
[]
[]
[null,null,"Schools ","Schools"]
[null,null,"Block","Block"]
[null,null,"(Primary)","(Secondary)"]
[null,null,"£","£"]
[]
[null,"FINAL ISB 2023/24",{"$f":"[17]Sheet2!$B$2","v":152715110.58055162},{"$f":"[17]Sheet2!$C$2","v":139305127.96148044}]
[]
{"$rows_left_out":16}
{"sheet":"LogIn","index":8,"n_rows":85,"n_cols":3,"rows_kept":85,"cut":false,"hidden":true,"merged":[]}
["User Name","Password","ID"]
["Alderman's Green ","NcR96Na",1]
["Aldermoor Farm","8UBcN4",2]
["Allesley","uE98HX",3]
["Allesley Hall","c2r66H",4]
["Broad Heath","94ctnJ",5]
["Cannon Park","4V8gK4",6]
["Charter","bHkpG8a",7]
["Clifford Bridge ","VksmRa1a",8]
["Coundon Primary","4Y428c",9]
["Courthouse Green","BE75nX1a",10]
["Earlsdon","ZkcST6",11]
["Eastern Green Junior","24x4Xc",12]
["Edgewick","R3kRR4",13]
["Ernesford Grange","GKD5A2",14]
["Finham","9TWJzm1a",15]
["Frederick Bird","agw9kda",16]
["Gosford Park ","cuxXcd",17]
["Grange Farm","V2DGxe",18]
["Grangehurst","aFbkW3",19]
{"$rows_left_out":66}
{"sheet":"LoginPage","index":9,"n_rows":0,"n_cols":0,"rows_kept":0,"cut":false,"hidden":false,"merged":[]}

{"sheet":"Funding Floor","index":10,"n_rows":42,"n_cols":14,"rows_kept":42,"cut":false,"hidden":true,"merged":[[19,8,19,9],[33,8,33,9],[8,8,8,9],[31,8,31,9],[21,8,21,9],[26,8,26,9],[13,8,13,9],[17,8,17,9],[1,0,1,11],[2,0,2,11],[3,0,3,11],[5,0,5,11],[15,8,15,9]]}
[{"$f":"'Summary of Funding'!A1","v":"Date Issued: 28th March 2024"},null,null,null,null,null,null,null,null,null,null,{"$f":"'Summary of Funding'!H1","v":"Last amended: 29th February 2024"}]
["COVENTRY CITY COUNCIL - PEOPLE'S DIRECTORATE"]
[{"$f":"'Summary of Funding'!A3:H3","v":"2024/25 Funding Allocations for Schools"},null,null,null,null,null,null,null,null,null,null,null,null,{"$f":"'Summary of Funding'!N3","v":3}]
["Calculation of Funding Floor"]
[]
[{"$f":"VLOOKUP((\"P\"&N3),[18]Formula!$A$10:$X$96,3,FALSE)","v":"Allesley"},null,null,null,null,null,null,null,null,null,null,null,null,"Checks"]
[]
[]
[null,null,null,null,null,null,null,null,"£",null,null,"£"]
[]
["2020/21 Total funding allocated after MFL",null,null,null,null,null,null,null,null,null,null,{"$f":"VLOOKUP((\"P\"&$N$3),'[19]Funding Floor'!$A$3:$U$90,6,FALSE)","v":1438986.0832845215},null,{"$f":"VLOOKUP((\"P\"&$N$3),'[19]Funding Floor'!$A$3:$U$90,6,FALSE)-L11","v":0}]
[]
["Less: "]
["2020/21 Mobility",null,null,null,null,null,null,null,{"$f":"VLOOKUP((\"P\"&$N$3),'[19]Funding Floor'!$A$3:$U$90,7,FALSE)","v":0},{"$f":"VLOOKUP((\"P\"&$N$3),'[19]Funding Floor'!$A$3:$U$90,6,FALSE)","v":1438986.0832845215},null,null,null,{"$f":"VLOOKUP((\"P\"&$N$3),'[19]Funding Floor'!$A$3:$U$90,7,FALSE)-I14","v":0}]
[]
["2020/21 Lump Sum",null,null,null,null,null,null,null,{"$f":"VLOOKUP((\"P\"&$N$3),'[19]Funding Floor'!$A$3:$U$90,8,FALSE)","v":110364.09999999999},{"$f":"VLOOKUP((\"P\"&$N$3),'[19]Funding Floor'!$A$3:$U$90,6,FALSE)","v":1438986.0832845215},null,null,null,{"$f":"VLOOKUP((\"P\"&$N$3),'[19]Funding Floor'!$A$3:$U$90,8,FALSE)-I16","v":0}]
[]
["2020/21 Split Site",null,null,null,null,null,null,null,{"$f":"VLOOKUP((\"P\"&$N$3),'[19]Funding Floor'!$A$3:$U$90,9,FALSE)","v":0},{"$f":"VLOOKUP((\"P\"&$N$3),'[19]Funding Floor'!$A$3:$U$90,6,FALSE)","v":1438986.0832845215},null,null,null,{"$f":"VLOOKUP((\"P\"&$N$3),'[19]Funding Floor'!$A$3:$U$90,9,FALSE)-I18","v":0}]
[]
["2020/21 Rates Funding",null,null,null,null,null,null,null,{"$f":"VLOOKUP((\"P\"&$N$3),'[19]Funding Floor'!$A$3:$U$90,11,FALSE)","v":45108},{"$f":"VLOOKUP((\"P\"&$N$3),'[19]Funding Floor'!$A$3:$U$90,6,FALSE)","v":1438986.0832845215},null,null,null,{"$f":"VLOOKUP((\"P\"&$N$3),'[19]Funding Floor'!$A$3:$U$90,11,FALSE)-I20","v":0}]
{"$rows_left_out":22}